Reaction Details
TargetIntegrin alpha-V/beta-3
LigandBDBM50072513
Substrate/Competitorn/a
Meas. Tech.ChEMBL_220414 (CHEMBL843254)
Ki 10±n/a nM
Citation Keenan, RMLago, MAMiller, WHAli, FECousins, RDHall, LBHwang, SMJakas, DRKwon, CLouden, CNguyen, TTOhlstein, EHRieman, DJRoss, STSamanen, JMSmith, BRStadel, JTakata, DTVickery, LYuan, CCYue, TL Discovery of an imidazopyridine-containing 1,4-benzodiazepine nonpeptide vitronectin receptor (alpha v beta 3) antagonist with efficacy in a restenosis model. Bioorg Med Chem Lett8:3171-6 (1999) Integrin alpha-V/beta-3
Name:Integrin alpha-V/beta-3
Type:Enzyme
Mol. Mass.:n/a
Description:n/a
Components:This complex has 2 components.
Component 1
Name:Integrin alpha-V
Synonyms:ITAV_HUMAN Integrin alpha-V/alpha-5 VNRA Vitronectin receptor | Vitronectin receptor subunit alpha
Type:PROTEIN
Mol. Mass.:116024.92
Organism:Homo sapiens (Human)
Description:ChEMBL_582336
Residue:1048
Component 2
Name:Integrin beta-3
Synonyms:CD_antigen=CD61 GPIIIa ITGB3 Platelet membrane glycoprotein IIIa
Type:Protein
Mol. Mass.:87038.91
Organism:Homo sapiens (Human)
Description:P05106
Residue:788
BDBM50072513
NameBDBM50072513
Synonyms:CHEMBL105982 | {(S)-7-[Methyl-(5-methyl-1H-imidazo[4,5-b]pyridin-2-ylmethyl)-carbamoyl]-3-oxo-2,3,4,5-tetrahydro-1H-benzo[e][1,4]diazepin-2-yl}-acetic acid
TypeSmall organic molecule
Emp. Form.C21H22N6O4
Mol. Mass.422.4372
SMILESCN(Cc1nc2nc(C)ccc2[nH]1)C(=O)c1ccc2N[C@@H](CC(O)=O)C(=O)NCc2c1