Reaction Details
TargetAlpha-2B adrenergic receptor
LigandBDBM50403755
Substrate/Competitorn/a
Meas. Tech.ChEMBL_32528 (CHEMBL641409)
IC50 1.5±n/a nM
Citation Kennis, LEBischoff, FPMertens, CJLove, CJVan den Keybus, FAPieters, SBraeken, MMegens, AALeysen, JE New 2-substituted 1,2,3,4-tetrahydrobenzofuro[3,2-c]pyridine having highly active and potent central alpha 2-antagonistic activity as potential antidepressants. Bioorg Med Chem Lett10:71-4 (2000) Alpha-2B adrenergic receptor
Name:Alpha-2B adrenergic receptor
Type:Enzyme
Mol. Mass.:49964.20
Organism:Homo sapiens (Human)
Description:P18089
Residue:450
BDBM50403755
NameBDBM50403755
Synonyms:CHEMBL163190
TypeSmall organic molecule
Emp. Form.C23H23N3O2
Mol. Mass.373.4476
SMILESCc1nc2cccc(C)n2c(=O)c1CCN1CCc2oc3ccccc3c2C1