Reaction Details
TargetAlpha-2B adrenergic receptor
LigandBDBM50403745
Substrate/Competitorn/a
Meas. Tech.ChEMBL_32528 (CHEMBL641409)
IC50 2±n/a nM
Citation Kennis, LEBischoff, FPMertens, CJLove, CJVan den Keybus, FAPieters, SBraeken, MMegens, AALeysen, JE New 2-substituted 1,2,3,4-tetrahydrobenzofuro[3,2-c]pyridine having highly active and potent central alpha 2-antagonistic activity as potential antidepressants. Bioorg Med Chem Lett10:71-4 (2000) Alpha-2B adrenergic receptor
Name:Alpha-2B adrenergic receptor
Type:Enzyme
Mol. Mass.:49964.20
Organism:Homo sapiens (Human)
Description:P18089
Residue:450
BDBM50403745
NameBDBM50403745
Synonyms:CHEMBL162490
TypeSmall organic molecule
Emp. Form.C23H23N3O3
Mol. Mass.389.447
SMILESCOc1cccn2c1nc(C)c(CCN1CCc3oc4ccccc4c3C1)c2=O