Reaction Details
TargetAlpha-2B adrenergic receptor
LigandBDBM50115644
Substrate/Competitorn/a
Meas. Tech.ChEMBL_32528 (CHEMBL641409)
IC50 224±n/a nM
Citation Kennis, LEBischoff, FPMertens, CJLove, CJVan den Keybus, FAPieters, SBraeken, MMegens, AALeysen, JE New 2-substituted 1,2,3,4-tetrahydrobenzofuro[3,2-c]pyridine having highly active and potent central alpha 2-antagonistic activity as potential antidepressants. Bioorg Med Chem Lett10:71-4 (2000) Alpha-2B adrenergic receptor
Name:Alpha-2B adrenergic receptor
Type:Enzyme
Mol. Mass.:49964.20
Organism:Homo sapiens (Human)
Description:P18089
Residue:450
BDBM50115644
NameBDBM50115644
Synonyms:(+/-)-12-Methyl-1,2,3,4,9,13b-hexahydro-2,4a,5-triaza-tribenzo[a,c,e]cycloheptene CHEMBL654 ORG 3770 | REMERON
TypeSmall organic molecule
Emp. Form.C17H19N3
Mol. Mass.265.3529
SMILESCN1CCN2C(C1)c1ccccc1Cc1cccnc21