Reaction Details
TargetAlpha-2C adrenergic receptor
LigandBDBM50403737
Substrate/Competitorn/a
Meas. Tech.ChEBML_33659
IC50 6.6±n/a nM
Citation Kennis, LEBischoff, FPMertens, CJLove, CJVan den Keybus, FAPieters, SBraeken, MMegens, AALeysen, JE New 2-substituted 1,2,3,4-tetrahydrobenzofuro[3,2-c]pyridine having highly active and potent central alpha 2-antagonistic activity as potential antidepressants. Bioorg Med Chem Lett10:71-4 (2000) Alpha-2C adrenergic receptor
Name:Alpha-2C adrenergic receptor
Type:Enzyme
Mol. Mass.:49552.32
Organism:Homo sapiens (Human)
Description:P18825
Residue:462
BDBM50403737
NameBDBM50403737
Synonyms:CHEMBL165776
TypeSmall organic molecule
Emp. Form.C23H23N3O2
Mol. Mass.373.4476
SMILESCc1nc2ccccn2c(=O)c1CCCN1CCc2oc3ccccc3c2C1