Reaction Details
Target5-hydroxytryptamine receptor 7
LigandBDBM31005
Substrate/Competitorn/a
Meas. Tech.ChEMBL_3771 (CHEMBL619052)
Ki 63±n/a nM
Citation López-Rodríguez, MLPorras, EBenhamú, BRamos, JAMorcillo, MJLavandera, JL First pharmacophoric hypothesis for 5-HT7 antagonism. Bioorg Med Chem Lett10:1097-100 (2000) 5-hydroxytryptamine receptor 7
Name:5-hydroxytryptamine receptor 7
Type:G Protein-Coupled Receptor (GPCR)
Mol. Mass.:49852.62
Organism:Rattus norvegicus (rat)
Description:Rat cloned 5-HT7R.
Residue:448
BDBM31005
NameBDBM31005
Synonyms:2-methyl-1,2,3,4,10,14b-hexahydrodibenzo[c,f]pyrazino[1,2-a]azepine MLS000069681 cid_68551
TypeSmall organic molecule
Emp. Form.C18H21ClN2
Mol. Mass.300.826
SMILESCl.CN1CCN2C(C1)c1ccccc1Cc1ccccc21