Reaction Details
Target5-hydroxytryptamine receptor 7
LigandBDBM50130279
Substrate/Competitorn/a
Meas. Tech.ChEMBL_3771 (CHEMBL619052)
Ki 3.2±n/a nM
Citation López-Rodríguez, MLPorras, EBenhamú, BRamos, JAMorcillo, MJLavandera, JL First pharmacophoric hypothesis for 5-HT7 antagonism. Bioorg Med Chem Lett10:1097-100 (2000) 5-hydroxytryptamine receptor 7
Name:5-hydroxytryptamine receptor 7
Type:G Protein-Coupled Receptor (GPCR)
Mol. Mass.:49852.62
Organism:Rattus norvegicus (rat)
Description:Rat cloned 5-HT7R.
Residue:448
BDBM50130279
NameBDBM50130279
Synonyms:(R)-4-Methyl-1-(2-(1-toluene-3-sulfonyl)-pyrrolidin-2-yl)-ethyl)-piperidine (Oxalate salt) 4-Methyl-1-{2-[(S)-1-(toluene-3-sulfonyl)-pyrrolidin-2-yl]-ethyl}-piperidine CHEMBL12624 | SB-258741
TypeSmall organic molecule
Emp. Form.C19H30N2O2S
Mol. Mass.350.519
SMILESCC1CCN(CC[C@H]2CCCN2S(=O)(=O)c2cccc(C)c2)CC1