Reaction Details
Target5-hydroxytryptamine receptor 7
LigandBDBM50403785
Substrate/Competitorn/a
Meas. Tech.ChEBML_3771
Ki<10000±n/a nM
Citation López-Rodríguez, MLPorras, EBenhamú, BRamos, JAMorcillo, MJLavandera, JL First pharmacophoric hypothesis for 5-HT7 antagonism. Bioorg Med Chem Lett10:1097-100 (2000) 5-hydroxytryptamine receptor 7
Name:5-hydroxytryptamine receptor 7
Type:G Protein-Coupled Receptor (GPCR)
Mol. Mass.:49852.62
Organism:Rattus norvegicus (rat)
Description:Rat cloned 5-HT7R.
Residue:448
BDBM50403785
NameBDBM50403785
Synonyms:CHEMBL12868
TypeSmall organic molecule
Emp. Form.C20H26N2O2S
Mol. Mass.358.498
SMILESCC1CCN(CCCCN2c3cccc4cccc(c34)S2(=O)=O)CC1