Reaction Details
TargetThymidylate synthase
LigandBDBM50403878
Substrate/Competitorn/a
Meas. Tech.ChEBML_209980
Ki 2.1±n/a nM
Citation Bavetsias, VMarriott, JHTheti, DSMelin, JCWilson, SCJackman, AL Cyclopenta[g]quinazoline-based antifolates: the effect of the chirality at the 6-position on the inhibition of thymidylate synthase (TS). Bioorg Med Chem Lett11:3015-7 (2001) Thymidylate synthase
Name:Thymidylate synthase
Type:PROTEIN
Mol. Mass.:34957.15
Organism:Mus musculus
Description:ChEMBL_1340097
Residue:307
BDBM50403878
NameBDBM50403878
Synonyms:CHEMBL320651
TypeSmall organic molecule
Emp. Form.C32H33N9O7
Mol. Mass.655.6605
SMILESCc1nc2cc3CC[C@@H](N(CC#C)c4ccc(cc4)C(=O)N[C@@H](CCC(=O)N[C@H](CCC(O)=O)c4nnn[nH]4)C(O)=O)c3cc2c(=O)[nH]1