Reaction Details
TargetAcyl carrier protein,/NADH dehydrogenase [ubiquinone] flavoprotein 1, mitochondrial
LigandBDBM50403900
Substrate/Competitorn/a
Meas. Tech.ChEMBL_141738 (CHEMBL749250)
IC50 0.540000±n/a nM
Citation Tormo, JREstornell, EGallardo, TGonzález, MCCavé, AGranell, SCortes, DZafra-Polo, MC Gamma-lactone-Functionalized antitumoral acetogenins are the most potent inhibitors of mitochondrial complex I. Bioorg Med Chem Lett11:681-4 (2001) Acyl carrier protein,/NADH dehydrogenase [ubiquinone] flavoprotein 1, mitochondrial
Name:Acyl carrier protein,/NADH dehydrogenase [ubiquinone] flavoprotein 1, mitochondrial
Synonyms:Mitochondrial complex I; NADH oxidoreductase
Type:n/a
Mol. Mass.:n/a
Description:ASSAY_ID of EBI is 141738
Components:This complex has 2 components.
Component 1
Name:NADH dehydrogenase [ubiquinone] flavoprotein 1, mitochondrial
Type:PROTEIN
Mol. Mass.:50659.85
Organism:Bos taurus
Description:EBI_100771
Residue:464
Component 2
Name:Acyl carrier protein, mitochondrial
Synonyms:ACP CI-SDAP NDUFAB1
Type:PROTEIN
Mol. Mass.:17397.64
Organism:Bos taurus
Description:ChEMBL_469770
Residue:156
BDBM50403900
NameBDBM50403900
Synonyms:CHEMBL161030
TypeSmall organic molecule
Emp. Form.C37H67NO8
Mol. Mass.653.9298
SMILESCCCCCCCCCC[C@@H](O)[C@@H]1CC[C@H](O1)[C@@H](O)CC[C@H](O)[C@@H]1CC[C@@H](CCCCCCC[C@H]2CC(CC(C)N=O)C(=O)O2)O1