Reaction Details
Target5-hydroxytryptamine receptor 2C
LigandBDBM50403959
Substrate/Competitorn/a
Meas. Tech.ChEBML_2739
IC50<1000±n/a nM
Citation Andrés, JIAlcázar, JAlonso, JMDíaz, AFernández, JGil, PIturrino, LMatesanz, EMeert, TFMegens, ASipido, VK Synthesis and structure-activity relationship of 2-(aminoalkyl)-2,3,3a,8-tetrahydrodibenzo[c,f]isoxazolo[2,3-a]azepine derivatives: a novel series of 5-HT(2A/2C) receptor antagonists. Part 1. Bioorg Med Chem Lett12:243-8 (2001) 
 
5-hydroxytryptamine receptor 2C
Name:5-hydroxytryptamine receptor 2C
Type:G Protein-Coupled Receptor (GPCR)
Mol. Mass.:51836.79
Organism:Homo sapiens (Human)
Description:P28335
Residue:458
BDBM50403959
NameBDBM50403959
Synonyms:CHEMBL79838
TypeSmall organic molecule
Emp. Form.C27H28ClN3O
Mol. Mass.445.984
SMILESClc1cccc(c1)N1CCN(CC2CC3N(O2)c2ccccc2Cc2ccccc32)CC1