Reaction Details
Target5-hydroxytryptamine receptor 2A
LigandBDBM50403963
Substrate/Competitorn/a
Meas. Tech.ChEBML_2508
IC50<1000±n/a nM
Citation Andrés, JIAlcázar, JAlonso, JMDíaz, AFernández, JGil, PIturrino, LMatesanz, EMeert, TFMegens, ASipido, VK Synthesis and structure-activity relationship of 2-(aminoalkyl)-2,3,3a,8-tetrahydrodibenzo[c,f]isoxazolo[2,3-a]azepine derivatives: a novel series of 5-HT(2A/2C) receptor antagonists. Part 1. Bioorg Med Chem Lett12:243-8 (2001) 
 
5-hydroxytryptamine receptor 2A
Name:5-hydroxytryptamine receptor 2A
Type:undefined
Mol. Mass.:52607.65
Organism:Homo sapiens (Human)
Description:P28223
Residue:471
BDBM50403963
NameBDBM50403963
Synonyms:CHEMBL83220
TypeSmall organic molecule
Emp. Form.C20H19F3N2O2
Mol. Mass.376.3723
SMILESCN(CC1CC2N(O1)c1ccccc1Cc1ccccc21)C(=O)C(F)(F)F