Reaction Details
Target5-hydroxytryptamine receptor 1D
LigandBDBM50146360
Substrate/Competitorn/a
Meas. Tech.ChEBML_1744
IC50 661±n/a nM
Citation Andrés, JIAlcázar, JAlonso, JMDíaz, AFernández, JGil, PIturrino, LMatesanz, EMeert, TFMegens, ASipido, VK Synthesis and structure-activity relationship of 2-(aminoalkyl)-2,3,3a,8-tetrahydrodibenzo[c,f]isoxazolo[2,3-a]azepine derivatives: a novel series of 5-HT(2A/2C) receptor antagonists. Part 1. Bioorg Med Chem Lett12:243-8 (2001) 
 
5-hydroxytryptamine receptor 1D
Name:5-hydroxytryptamine receptor 1D
Type:G Protein-Coupled Receptor (GPCR)
Mol. Mass.:41920.63
Organism:Homo sapiens (Human)
Description:Receptor binding assays were performed using human clone stably expressed in CHO cells.
Residue:377
BDBM50146360
NameBDBM50146360
Synonyms:CHEMBL328573 | Dimethyl-[(2S,3aR)-1-(2,3,3a,8-tetrahydro-1-oxa-12b-aza-dibenzo[e,h]azulen-2-yl)methyl]-amine
TypeSmall organic molecule
Emp. Form.C19H22N2O
Mol. Mass.294.3908
SMILESCN(C)C[C@@H]1C[C@H]2N(O1)c1ccccc1Cc1ccccc21