Reaction Details
TargetAlpha-1A adrenergic receptor
LigandBDBM50403962
Substrate/Competitorn/a
Meas. Tech.ChEBML_33868
IC50 191±n/a nM
Citation Andrés, JIAlcázar, JAlonso, JMDíaz, AFernández, JGil, PIturrino, LMatesanz, EMeert, TFMegens, ASipido, VK Synthesis and structure-activity relationship of 2-(aminoalkyl)-2,3,3a,8-tetrahydrodibenzo[c,f]isoxazolo[2,3-a]azepine derivatives: a novel series of 5-HT(2A/2C) receptor antagonists. Part 1. Bioorg Med Chem Lett12:243-8 (2001) 
 
Alpha-1A adrenergic receptor
Name:Alpha-1A adrenergic receptor
Type:Cell-surface receptors
Mol. Mass.:51511.67
Organism:Homo sapiens (Human)
Description:P35348
Residue:466
BDBM50403962
NameBDBM50403962
Synonyms:CHEMBL81485
TypeSmall organic molecule
Emp. Form.C18H20N2O
Mol. Mass.280.3642
SMILESCNCC1CC2N(O1)c1ccccc1Cc1ccccc21