Reaction Details
TargetHistamine H1 receptor
LigandBDBM50403964
Substrate/Competitorn/a
Meas. Tech.ChEBML_84540
IC50 102±n/a nM
Citation Andrés, JIAlcázar, JAlonso, JMDíaz, AFernández, JGil, PIturrino, LMatesanz, EMeert, TFMegens, ASipido, VK Synthesis and structure-activity relationship of 2-(aminoalkyl)-2,3,3a,8-tetrahydrodibenzo[c,f]isoxazolo[2,3-a]azepine derivatives: a novel series of 5-HT(2A/2C) receptor antagonists. Part 1. Bioorg Med Chem Lett12:243-8 (2001) 
 
Histamine H1 receptor
Name:Histamine H1 receptor
Type:G Protein-Coupled Receptor (GPCR)
Mol. Mass.:55808.72
Organism:Homo sapiens (Human)
Description:Cell pellets from SK-N-MC cells transfected with human H1 receptor were used in binding assay.
Residue:487
BDBM50403964
NameBDBM50403964
Synonyms:CHEMBL310183 | R-95292
TypeSmall organic molecule
Emp. Form.C18H19ClN2O2
Mol. Mass.330.809
SMILESCN(C)CC1CC2N(O1)c1cc(Cl)ccc1Oc1ccccc21