Reaction Details
Target5-hydroxytryptamine receptor 2C
LigandBDBM50403963
Substrate/Competitorn/a
Meas. Tech.ChEBML_2739
IC50 692±n/a nM
Citation Andrés, JIAlcázar, JAlonso, JMDíaz, AFernández, JGil, PIturrino, LMatesanz, EMeert, TFMegens, ASipido, VK Synthesis and structure-activity relationship of 2-(aminoalkyl)-2,3,3a,8-tetrahydrodibenzo[c,f]isoxazolo[2,3-a]azepine derivatives: a novel series of 5-HT(2A/2C) receptor antagonists. Part 1. Bioorg Med Chem Lett12:243-8 (2001) 
 
5-hydroxytryptamine receptor 2C
Name:5-hydroxytryptamine receptor 2C
Type:G Protein-Coupled Receptor (GPCR)
Mol. Mass.:51836.79
Organism:Homo sapiens (Human)
Description:P28335
Residue:458
BDBM50403963
NameBDBM50403963
Synonyms:CHEMBL83220
TypeSmall organic molecule
Emp. Form.C20H19F3N2O2
Mol. Mass.376.3723
SMILESCN(CC1CC2N(O1)c1ccccc1Cc1ccccc21)C(=O)C(F)(F)F