Reaction Details
Target5-hydroxytryptamine receptor 2C
LigandBDBM50403973
Substrate/Competitorn/a
Meas. Tech.ChEBML_2739
IC50 19±n/a nM
Citation Andrés, JIAlcázar, JAlonso, JMDíaz, AFernández, JGil, PIturrino, LMatesanz, EMeert, TFMegens, ASipido, VK Synthesis and structure-activity relationship of 2-(aminoalkyl)-2,3,3a,8-tetrahydrodibenzo[c,f]isoxazolo[2,3-a]azepine derivatives: a novel series of 5-HT(2A/2C) receptor antagonists. Part 1. Bioorg Med Chem Lett12:243-8 (2001) 
 
5-hydroxytryptamine receptor 2C
Name:5-hydroxytryptamine receptor 2C
Type:G Protein-Coupled Receptor (GPCR)
Mol. Mass.:51836.79
Organism:Homo sapiens (Human)
Description:P28335
Residue:458
BDBM50403973
NameBDBM50403973
Synonyms:CHEMBL310018
TypeSmall organic molecule
Emp. Form.C21H26N2O
Mol. Mass.322.4439
SMILESCN(C)CCCC1CC2N(O1)c1ccccc1Cc1ccccc21