Reaction Details
Target5-hydroxytryptamine receptor 1A
LigandBDBM50146360
Substrate/Competitorn/a
Meas. Tech.ChEBML_1015
IC50 977±n/a nM
Citation Andrés, JIAlcázar, JAlonso, JMDíaz, AFernández, JGil, PIturrino, LMatesanz, EMeert, TFMegens, ASipido, VK Synthesis and structure-activity relationship of 2-(aminoalkyl)-2,3,3a,8-tetrahydrodibenzo[c,f]isoxazolo[2,3-a]azepine derivatives: a novel series of 5-HT(2A/2C) receptor antagonists. Part 1. Bioorg Med Chem Lett12:243-8 (2001) 
 
5-hydroxytryptamine receptor 1A
Name:5-hydroxytryptamine receptor 1A
Type:n/a
Mol. Mass.:46122.49
Organism:Homo sapiens (Human)
Description:n/a
Residue:422
BDBM50146360
NameBDBM50146360
Synonyms:CHEMBL328573 | Dimethyl-[(2S,3aR)-1-(2,3,3a,8-tetrahydro-1-oxa-12b-aza-dibenzo[e,h]azulen-2-yl)methyl]-amine
TypeSmall organic molecule
Emp. Form.C19H22N2O
Mol. Mass.294.3908
SMILESCN(C)C[C@@H]1C[C@H]2N(O1)c1ccccc1Cc1ccccc21