Reaction Details
TargetAlpha-2C adrenergic receptor
LigandBDBM31005
Substrate/Competitorn/a
Meas. Tech.ChEBML_33660
IC50 43±n/a nM
Citation Andrés, JIAlcázar, JAlonso, JMDíaz, AFernández, JGil, PIturrino, LMatesanz, EMeert, TFMegens, ASipido, VK Synthesis and structure-activity relationship of 2-(aminoalkyl)-2,3,3a,8-tetrahydrodibenzo[c,f]isoxazolo[2,3-a]azepine derivatives: a novel series of 5-HT(2A/2C) receptor antagonists. Part 1. Bioorg Med Chem Lett12:243-8 (2001) 
 
Alpha-2C adrenergic receptor
Name:Alpha-2C adrenergic receptor
Type:Enzyme
Mol. Mass.:49552.32
Organism:Homo sapiens (Human)
Description:P18825
Residue:462
BDBM31005
NameBDBM31005
Synonyms:2-methyl-1,2,3,4,10,14b-hexahydrodibenzo[c,f]pyrazino[1,2-a]azepine MLS000069681 cid_68551
TypeSmall organic molecule
Emp. Form.C18H21ClN2
Mol. Mass.300.826
SMILESCl.CN1CCN2C(C1)c1ccccc1Cc1ccccc21