Reaction Details
TargetD(2) dopamine receptor
LigandBDBM50403957
Substrate/Competitorn/a
Meas. Tech.ChEBML_61645
IC50 9550±n/a nM
Citation Andrés, JIAlcázar, JAlonso, JMDíaz, AFernández, JGil, PIturrino, LMatesanz, EMeert, TFMegens, ASipido, VK Synthesis and structure-activity relationship of 2-(aminoalkyl)-2,3,3a,8-tetrahydrodibenzo[c,f]isoxazolo[2,3-a]azepine derivatives: a novel series of 5-HT(2A/2C) receptor antagonists. Part 1. Bioorg Med Chem Lett12:243-8 (2001) 
 
D(2) dopamine receptor
Name:D(2) dopamine receptor
Type:Cell-surface receptors
Mol. Mass.:50647.10
Organism:Homo sapiens (Human)
Description:P14416
Residue:443
BDBM50403957
NameBDBM50403957
Synonyms:CHEMBL313189
TypeSmall organic molecule
Emp. Form.C20H24N2O
Mol. Mass.308.4174
SMILESCN(C)CCC1CC2N(O1)c1ccccc1Cc1ccccc21