Reaction Details
TargetAlpha-2C adrenergic receptor
LigandBDBM50146360
Substrate/Competitorn/a
Meas. Tech.ChEBML_33660
IC50 1862±n/a nM
Citation Andrés, JIAlcázar, JAlonso, JMDíaz, AFernández, JGil, PIturrino, LMatesanz, EMeert, TFMegens, ASipido, VK Synthesis and structure-activity relationship of 2-(aminoalkyl)-2,3,3a,8-tetrahydrodibenzo[c,f]isoxazolo[2,3-a]azepine derivatives: a novel series of 5-HT(2A/2C) receptor antagonists. Part 1. Bioorg Med Chem Lett12:243-8 (2001) 
 
Alpha-2C adrenergic receptor
Name:Alpha-2C adrenergic receptor
Type:Enzyme
Mol. Mass.:49552.32
Organism:Homo sapiens (Human)
Description:P18825
Residue:462
BDBM50146360
NameBDBM50146360
Synonyms:CHEMBL328573 | Dimethyl-[(2S,3aR)-1-(2,3,3a,8-tetrahydro-1-oxa-12b-aza-dibenzo[e,h]azulen-2-yl)methyl]-amine
TypeSmall organic molecule
Emp. Form.C19H22N2O
Mol. Mass.294.3908
SMILESCN(C)C[C@@H]1C[C@H]2N(O1)c1ccccc1Cc1ccccc21