Reaction Details
Target5-hydroxytryptamine receptor 2C
LigandBDBM50403984
Substrate/Competitorn/a
Meas. Tech.ChEBML_2740
IC50 3.9±n/a nM
Citation Andrés, JIAlcázar, JAlonso, JMDíaz, AFernández, JGil, PIturrino, LMatesanz, EMeert, TFMegens, ASipido, VK Synthesis and structure-activity relationship of 2-(aminoalkyl)-2,3,3a,8-tetrahydrodibenzo[c,f]isoxazolo[2,3-a]azepine derivatives: a novel series of 5-HT(2A/2C) receptor antagonists. Part 2. Bioorg Med Chem Lett12:249-53 (2001) 
 
5-hydroxytryptamine receptor 2C
Name:5-hydroxytryptamine receptor 2C
Type:G Protein-Coupled Receptor (GPCR)
Mol. Mass.:51836.79
Organism:Homo sapiens (Human)
Description:P28335
Residue:458
BDBM50403984
NameBDBM50403984
Synonyms:CHEMBL82635
TypeSmall organic molecule
Emp. Form.C20H24N2O
Mol. Mass.308.4174
SMILESCN(C)CC1CC2N(O1)c1cccc(C)c1Cc1ccccc21