Reaction Details
TargetIntegrin alpha-V/beta-3
LigandBDBM50121151
Substrate/Competitorn/a
Meas. Tech.ChEMBL_32648 (CHEMBL642143)
IC50 0.290000±n/a nM
Citation Brashear, KMHunt, CAKucer, BTDuggan, MEHartman, GDRodan, GARodan, SBLeu, CTPrueksaritanont, TFernandez-Metzler, CBarrish, AHomnick, CFHutchinson, JHColeman, PJ Non-peptide alpha(v)beta(3) antagonists. Part 5: identification of potent RGD mimetics incorporating 2-aryl beta-amino acids as aspartic acid replacements. Bioorg Med Chem Lett12:3483-6 (2002) Integrin alpha-V/beta-3
Name:Integrin alpha-V/beta-3
Type:Enzyme
Mol. Mass.:n/a
Description:n/a
Components:This complex has 2 components.
Component 1
Name:Integrin alpha-V
Synonyms:ITAV_HUMAN Integrin alpha-V/alpha-5 VNRA Vitronectin receptor | Vitronectin receptor subunit alpha
Type:PROTEIN
Mol. Mass.:116024.92
Organism:Homo sapiens (Human)
Description:ChEMBL_582336
Residue:1048
Component 2
Name:Integrin beta-3
Synonyms:CD_antigen=CD61 GPIIIa ITGB3 Platelet membrane glycoprotein IIIa
Type:Protein
Mol. Mass.:87038.91
Organism:Homo sapiens (Human)
Description:P05106
Residue:788
BDBM50121151
NameBDBM50121151
Synonyms:3-[5-(3-Cyclopropyl-5,6,7,8-tetrahydro-[1,8]naphthyridin-2-yl)-pentanoylamino]-2-(2,3-dihydro-benzofuran-6-yl)-propionic acid | CHEMBL116142
TypeSmall organic molecule
Emp. Form.C27H33N3O4
Mol. Mass.463.5686
SMILESOC(=O)C(CNC(=O)CCCCc1nc2NCCCc2cc1C1CC1)c1ccc2CCOc2c1