Reaction Details
TargetCoagulation factor X
LigandBDBM17084
Substrate/Competitorn/a
Meas. Tech.ChEBML_48837
Ki 11±n/a nM
Citation Chou, YLDavey, DDEagen, KAGriedel, BDKaranjawala, RPhillips, GBSacchi, KLShaw, KJWu, SCLentz, DLiang, AMTrinh, LMorrissey, MMKochanny, MJ Structure-activity relationships of substituted benzothiophene-anthranilamide factor Xa inhibitors. Bioorg Med Chem Lett13:507-11 (2003) Coagulation factor X
Name:Coagulation factor X
Type:Enzyme
Mol. Mass.:54726.60
Organism:Homo sapiens (Human)
Description:n/a
Residue:488
BDBM17084
NameBDBM17084
Synonyms:3-chloro-N-{2-[(4-fluorophenyl)carbamoyl]-4-methylphenyl}-1-benzothiophene-2-carboxamide | anthranilamide compound 1
TypeSmall organic molecule
Emp. Form.C23H16ClFN2O2S
Mol. Mass.438.902
SMILESCc1ccc(NC(=O)c2sc3ccccc3c2Cl)c(c1)C(=O)Nc1ccc(F)cc1