Reaction Details
TargetProthrombin
LigandBDBM50404147
Substrate/Competitorn/a
Meas. Tech.ChEBML_208677
Ki>5000±n/a nM
Citation Chou, YLDavey, DDEagen, KAGriedel, BDKaranjawala, RPhillips, GBSacchi, KLShaw, KJWu, SCLentz, DLiang, AMTrinh, LMorrissey, MMKochanny, MJ Structure-activity relationships of substituted benzothiophene-anthranilamide factor Xa inhibitors. Bioorg Med Chem Lett13:507-11 (2003) Prothrombin
Name:Prothrombin
Type:Protein
Mol. Mass.:70029.57
Organism:Homo sapiens (Human)
Description:P00734
Residue:622
BDBM50404147
NameBDBM50404147
Synonyms:CHEMBL422844
TypeSmall organic molecule
Emp. Form.C20H16Cl2N2O4S2
Mol. Mass.483.388
SMILESCc1ccc(NC(=O)c2scc(c2Cl)S(C)(=O)=O)c(c1)C(=O)Nc1ccc(Cl)cc1