Reaction Details
TargetCoagulation factor X
LigandBDBM50404147
Substrate/Competitorn/a
Meas. Tech.ChEBML_48837
Ki 14±n/a nM
Citation Chou, YLDavey, DDEagen, KAGriedel, BDKaranjawala, RPhillips, GBSacchi, KLShaw, KJWu, SCLentz, DLiang, AMTrinh, LMorrissey, MMKochanny, MJ Structure-activity relationships of substituted benzothiophene-anthranilamide factor Xa inhibitors. Bioorg Med Chem Lett13:507-11 (2003) Coagulation factor X
Name:Coagulation factor X
Type:Enzyme
Mol. Mass.:54726.60
Organism:Homo sapiens (Human)
Description:n/a
Residue:488
BDBM50404147
NameBDBM50404147
Synonyms:CHEMBL422844
TypeSmall organic molecule
Emp. Form.C20H16Cl2N2O4S2
Mol. Mass.483.388
SMILESCc1ccc(NC(=O)c2scc(c2Cl)S(C)(=O)=O)c(c1)C(=O)Nc1ccc(Cl)cc1