Reaction Details
TargetCoagulation factor X
LigandBDBM50404122
Substrate/Competitorn/a
Meas. Tech.ChEBML_48837
Ki 2.2±n/a nM
Citation Chou, YLDavey, DDEagen, KAGriedel, BDKaranjawala, RPhillips, GBSacchi, KLShaw, KJWu, SCLentz, DLiang, AMTrinh, LMorrissey, MMKochanny, MJ Structure-activity relationships of substituted benzothiophene-anthranilamide factor Xa inhibitors. Bioorg Med Chem Lett13:507-11 (2003) Coagulation factor X
Name:Coagulation factor X
Type:Enzyme
Mol. Mass.:54726.60
Organism:Homo sapiens (Human)
Description:n/a
Residue:488
BDBM50404122
NameBDBM50404122
Synonyms:CHEMBL146079
TypeSmall organic molecule
Emp. Form.C23H15Cl3N2O3S
Mol. Mass.505.801
SMILESCOc1cc(Cl)cc(C(=O)Nc2ccc(Cl)cc2)c1NC(=O)c1sc2ccccc2c1Cl