Reaction Details
TargetThymidylate synthase
LigandBDBM18050
Substrate/Competitorn/a
Meas. Tech.ChEMBL_208959 (CHEMBL814578)
IC50 40000±n/a nM
Citation Nair, MGChen, SYKisliuk, RLGaumont, YStrumpf, D Folate analogues altered in the C9-N10 bridge region. 16. Synthesis and antifolate activity of 11-thiohomoaminopterin. J Med Chem23:899-903 (1980) Thymidylate synthase
Name:Thymidylate synthase
Type:Enzyme
Mol. Mass.:36576.54
Organism:Lactobacillus casei
Description:n/a
Residue:316
BDBM18050
NameBDBM18050
Synonyms:2-[(4-{[(2,4-diaminopteridin-6-yl)methyl](methyl)amino}phenyl)formamido]pentanedioic acid MTX cid_126941
TypeSmall organic molecule
Emp. Form.C20H22N8O5
Mol. Mass.454.4393
SMILESCN(Cc1cnc2nc(N)nc(N)c2n1)c1ccc(cc1)C(=O)N[C@@H](CCC(O)=O)C(O)=O