Reaction Details
TargetMalate dehydrogenase, mitochondrial
LigandBDBM50404713
Substrate/Competitorn/a
Meas. Tech.ChEMBL_123822 (CHEMBL733653)
IC50 912010.84±n/a nM
Citation Coats, EAShah, KJMilstein, SRGenther, CSNene, DMRoesener, JSchmidt, JPleiss, MWagner, EBaker, JK 4-hydroxyquinoline-3-carboxylic acids as inhibitors of cell respiration. 2. Quantitative structure-activity relationship of dehydrogenase enzyme and Ehrlich ascites tumor cell inhibitions. J Med Chem25:57-63 (1982) Malate dehydrogenase, mitochondrial
Name:Malate dehydrogenase, mitochondrial
Type:Oxidoreductase; homodimer
Mol. Mass.:35493.48
Organism:Sus scrofa (pig)
Description:Porcine heart mitochondria.
Residue:337
BDBM50404713
NameBDBM50404713
Synonyms:CHEMBL141025
TypeSmall organic molecule
Emp. Form.C12H9NO4
Mol. Mass.231.2042
SMILESCC(=O)c1ccc2c(O)c(cnc2c1)C(O)=O