Reaction Details
TargetCytochrome P450 2B1
LigandBDBM50017716
Substrate/Competitorn/a
Meas. Tech.ChEMBL_35522 (CHEMBL644755)
IC50 8200±n/a nM
Citation Little, PJRyan, AJ Inhibitors of hepatic mixed-function oxidases. 4. Effects of benzimidazole and related compounds on aryl hydrocarbon hydroxylase activity from phenobarbitone and 3-methylcholanthrene induced rats. J Med Chem25:622-6 (1982) Cytochrome P450 2B1
Name:Cytochrome P450 2B1
Type:PROTEIN
Mol. Mass.:55940.51
Organism:Rattus norvegicus
Description:ChEMBL_774167
Residue:491
BDBM50017716
NameBDBM50017716
Synonyms:2,2-Diphenyl-pentanoic acid 2-diethylamino-ethyl ester 2-Benzhydryl-pentanoic acid 2-diethylamino-ethyl ester PROADIFEN HYDROCHLORIDE
TypeSmall organic molecule
Emp. Form.C23H31NO2
Mol. Mass.353.4977
SMILESCCCC(C(=O)OCCN(CC)CC)(c1ccccc1)c1ccccc1