Reaction Details
TargetCytochrome P450 1A1
LigandBDBM24656
Substrate/Competitorn/a
Meas. Tech.ChEMBL_36220 (CHEMBL647916)
IC50 33000±n/a nM
Citation Little, PJRyan, AJ Inhibitors of hepatic mixed-function oxidases. 4. Effects of benzimidazole and related compounds on aryl hydrocarbon hydroxylase activity from phenobarbitone and 3-methylcholanthrene induced rats. J Med Chem25:622-6 (1982) Cytochrome P450 1A1
Name:Cytochrome P450 1A1
Type:PROTEIN
Mol. Mass.:59401.56
Organism:Rattus norvegicus
Description:ChEMBL_774160
Residue:524
BDBM24656
NameBDBM24656
Synonyms:4-PIM 4-phenyl-1H-imidazole CHEMBL14145 US9144538, 4-Phenylimidazole
TypeSmall organic molecule
Emp. Form.C9H8N2
Mol. Mass.144.1732
SMILESc1nc(c[nH]1)-c1ccccc1