Reaction Details
TargetCytochrome P450 2B1
LigandBDBM50404899
Substrate/Competitorn/a
Meas. Tech.ChEMBL_35524 (CHEMBL644757)
IC50 53703.18±n/a nM
Citation Murray, MRyan, AJLittle, PJ Inhibition of rat hepatic microsomal aminopyrine N-demethylase activity by benzimidazole derivatives. Quantitative structure-activity relationships. J Med Chem25:887-92 (1982) Cytochrome P450 2B1
Name:Cytochrome P450 2B1
Type:PROTEIN
Mol. Mass.:55940.51
Organism:Rattus norvegicus
Description:ChEMBL_774167
Residue:491
BDBM50404899
NameBDBM50404899
Synonyms:CHEMBL171977
TypeSmall organic molecule
Emp. Form.C16H16N2
Mol. Mass.236.3116
SMILESCc1cccc(Cc2nc3ccccc3[nH]2)c1C