Reaction Details
TargetCytochrome P450 2B1
LigandBDBM50404908
Substrate/Competitorn/a
Meas. Tech.ChEMBL_35524 (CHEMBL644757)
IC50 91201.08±n/a nM
Citation Murray, MRyan, AJLittle, PJ Inhibition of rat hepatic microsomal aminopyrine N-demethylase activity by benzimidazole derivatives. Quantitative structure-activity relationships. J Med Chem25:887-92 (1982) Cytochrome P450 2B1
Name:Cytochrome P450 2B1
Type:PROTEIN
Mol. Mass.:55940.51
Organism:Rattus norvegicus
Description:ChEMBL_774167
Residue:491
BDBM50404908
NameBDBM50404908
Synonyms:CHEMBL171135
TypeSmall organic molecule
Emp. Form.C13H16N2
Mol. Mass.200.2795
SMILESC1CCC(CC1)c1nc2ccccc2[nH]1