Reaction Details
TargetCytochrome P450 2B1
LigandBDBM50404936
Substrate/Competitorn/a
Meas. Tech.ChEMBL_35524 (CHEMBL644757)
IC50 22908.68±n/a nM
Citation Murray, MRyan, AJLittle, PJ Inhibition of rat hepatic microsomal aminopyrine N-demethylase activity by benzimidazole derivatives. Quantitative structure-activity relationships. J Med Chem25:887-92 (1982) Cytochrome P450 2B1
Name:Cytochrome P450 2B1
Type:PROTEIN
Mol. Mass.:55940.51
Organism:Rattus norvegicus
Description:ChEMBL_774167
Residue:491
BDBM50404936
NameBDBM50404936
Synonyms:CHEMBL169212
TypeSmall organic molecule
Emp. Form.C20H32N2
Mol. Mass.300.4815
SMILESCCCCCCCCCCCCCc1nc2ccccc2[nH]1