Reaction Details
Target2-Hydroxyacid oxidase 1
LigandBDBM50404998
Substrate/Competitorn/a
Meas. Tech.ChEMBL_71275 (CHEMBL685164)
IC50 180±n/a nM
Citation Williams, HWEichler, ERandall, WCRooney, CSCragoe, EJStreeter, KBSchwam, HMichelson, SRPatchett, AATaub, D Inhibitors of glycolic acid oxidase. 4-substituted 2,4-dioxobutanoic acid derivatives. J Med Chem26:1196-200 (1983) 2-Hydroxyacid oxidase 1
Name:2-Hydroxyacid oxidase 1
Type:PROTEIN
Mol. Mass.:40927.89
Organism:Homo sapiens (Human)
Description:ChEMBL_71275
Residue:370
BDBM50404998
NameBDBM50404998
Synonyms:CHEMBL276330
TypeSmall organic molecule
Emp. Form.C24H17NO4
Mol. Mass.383.3961
SMILESOC(=O)C(=O)CC(=O)c1ccc(cc1)-n1c(cc2ccccc12)-c1ccccc1