Reaction Details
Target2-Hydroxyacid oxidase 1
LigandBDBM50404999
Substrate/Competitorn/a
Meas. Tech.ChEMBL_71275 (CHEMBL685164)
IC50 600±n/a nM
Citation Williams, HWEichler, ERandall, WCRooney, CSCragoe, EJStreeter, KBSchwam, HMichelson, SRPatchett, AATaub, D Inhibitors of glycolic acid oxidase. 4-substituted 2,4-dioxobutanoic acid derivatives. J Med Chem26:1196-200 (1983) 2-Hydroxyacid oxidase 1
Name:2-Hydroxyacid oxidase 1
Type:PROTEIN
Mol. Mass.:40927.89
Organism:Homo sapiens (Human)
Description:ChEMBL_71275
Residue:370
BDBM50404999
NameBDBM50404999
Synonyms:CHEMBL282502
TypeSmall organic molecule
Emp. Form.C19H26O4
Mol. Mass.318.4073
SMILESCCCCCCCCCc1ccc(cc1)C(=O)CC(=O)C(O)=O