Reaction Details
Target2-Hydroxyacid oxidase 1
LigandBDBM50405006
Substrate/Competitorn/a
Meas. Tech.ChEMBL_71275 (CHEMBL685164)
IC50 19000±n/a nM
Citation Williams, HWEichler, ERandall, WCRooney, CSCragoe, EJStreeter, KBSchwam, HMichelson, SRPatchett, AATaub, D Inhibitors of glycolic acid oxidase. 4-substituted 2,4-dioxobutanoic acid derivatives. J Med Chem26:1196-200 (1983) 2-Hydroxyacid oxidase 1
Name:2-Hydroxyacid oxidase 1
Type:PROTEIN
Mol. Mass.:40927.89
Organism:Homo sapiens (Human)
Description:ChEMBL_71275
Residue:370
BDBM50405006
NameBDBM50405006
Synonyms:CHEMBL275811
TypeSmall organic molecule
Emp. Form.C12H10O4
Mol. Mass.218.2054
SMILESOC(=O)C(=O)CC(=O)C=Cc1ccccc1