Reaction Details
Target2-Hydroxyacid oxidase 1
LigandBDBM50125793
Substrate/Competitorn/a
Meas. Tech.ChEMBL_71275 (CHEMBL685164)
IC50 3000±n/a nM
Citation Williams, HWEichler, ERandall, WCRooney, CSCragoe, EJStreeter, KBSchwam, HMichelson, SRPatchett, AATaub, D Inhibitors of glycolic acid oxidase. 4-substituted 2,4-dioxobutanoic acid derivatives. J Med Chem26:1196-200 (1983) 2-Hydroxyacid oxidase 1
Name:2-Hydroxyacid oxidase 1
Type:PROTEIN
Mol. Mass.:40927.89
Organism:Homo sapiens (Human)
Description:ChEMBL_71275
Residue:370
BDBM50125793
NameBDBM50125793
Synonyms:4-(4-Cyclohexyl-phenyl)-2-hydroxy-4-oxo-but-2-enoic acid CHEMBL417634
TypeSmall organic molecule
Emp. Form.C16H18O4
Mol. Mass.274.3117
SMILESOC(=O)C(=O)CC(=O)c1ccc(cc1)C1CCCCC1