Reaction Details
TargetDihydrofolate reductase
LigandBDBM50291792
Substrate/Competitorn/a
Meas. Tech.ChEBML_55071
Ki 2570±n/a nM
Citation Hansch, CHathaway, BAGuo, ZRSelassie, CDDietrich, SWBlaney, JMLangridge, RVolz, KWKaufman, BT Crystallography, quantitative structure-activity relationships, and molecular graphics in a comparative analysis of the inhibition of dihydrofolate reductase from chicken liver and Lactobacillus casei by 4,6-diamino-1,2-dihydro-2,2-dimethyl-1-(substituted-phenyl)-s-triazine s. J Med Chem27:129-43 (1984) Dihydrofolate reductase
Name:Dihydrofolate reductase
Type:PROTEIN
Mol. Mass.:18437.08
Organism:Lactobacillus casei
Description:ChEMBL_1357878
Residue:163
BDBM50291792
NameBDBM50291792
Synonyms:4-[3-(4,6-Diamino-2,2-dimethyl-2H-[1,3,5]triazin-1-yl)-benzylamino]-benzenesulfonamide | CHEMBL21258
TypeSmall organic molecule
Emp. Form.C18H23N7O2S
Mol. Mass.401.486
SMILESCC1(C)N=C(N)N=C(N)N1c1cccc(CNc2ccc(cc2)S(N)(=O)=O)c1