Reaction Details
TargetDihydrofolate reductase
LigandBDBM50405088
Substrate/Competitorn/a
Meas. Tech.ChEBML_53616
Ki 6.8±n/a nM
Citation Hansch, CHathaway, BAGuo, ZRSelassie, CDDietrich, SWBlaney, JMLangridge, RVolz, KWKaufman, BT Crystallography, quantitative structure-activity relationships, and molecular graphics in a comparative analysis of the inhibition of dihydrofolate reductase from chicken liver and Lactobacillus casei by 4,6-diamino-1,2-dihydro-2,2-dimethyl-1-(substituted-phenyl)-s-triazine s. J Med Chem27:129-43 (1984) Dihydrofolate reductase
Name:Dihydrofolate reductase
Type:n/a
Mol. Mass.:21652.69
Organism:Gallus gallus (Chicken)
Description:n/a
Residue:189
BDBM50405088
NameBDBM50405088
Synonyms:CHEMBL31004
TypeSmall organic molecule
Emp. Form.C18H21N5S
Mol. Mass.339.458
SMILESCC1(C)N=C(N)N=C(N)N1c1ccc(CSc2ccccc2)cc1