Reaction Details
TargetDNA topoisomerase 3
LigandBDBM50022163
Substrate/Competitorn/a
Meas. Tech.ChEMBL_54525 (CHEMBL858266)
Ki 1950±n/a nM
Citation Wright, GEGambino, JJ Quantitative structure-activity relationships of 6-anilinouracils as inhibitors of Bacillus subtilis DNA polymerase III. J Med Chem27:181-5 (1984) DNA topoisomerase 3
Name:DNA topoisomerase 3
Type:PROTEIN
Mol. Mass.:81515.22
Organism:Bacillus subtilis
Description:ChEMBL_54525
Residue:727
BDBM50022163
NameBDBM50022163
Synonyms:6-(Indan-5-ylamino)-1H-pyrimidine-2,4-dione | CHEMBL54950
TypeSmall organic molecule
Emp. Form.C13H13N3O2
Mol. Mass.243.2612
SMILESO=c1cc(Nc2ccc3CCCc3c2)[nH]c(=O)[nH]1