Reaction Details
TargetDNA topoisomerase 3
LigandBDBM50405107
Substrate/Competitorn/a
Meas. Tech.ChEMBL_54525 (CHEMBL858266)
Ki 4198±n/a nM
Citation Wright, GEGambino, JJ Quantitative structure-activity relationships of 6-anilinouracils as inhibitors of Bacillus subtilis DNA polymerase III. J Med Chem27:181-5 (1984) DNA topoisomerase 3
Name:DNA topoisomerase 3
Type:PROTEIN
Mol. Mass.:81515.22
Organism:Bacillus subtilis
Description:ChEMBL_54525
Residue:727
BDBM50405107
NameBDBM50405107
Synonyms:CHEMBL54371
TypeSmall organic molecule
Emp. Form.C13H15N3O2
Mol. Mass.245.2771
SMILESCCc1ccc(Nc2cc(=O)[nH]c(=O)[nH]2)cc1C