Reaction Details
TargetDNA topoisomerase 3
LigandBDBM50028331
Substrate/Competitorn/a
Meas. Tech.ChEMBL_54524 (CHEMBL663871)
Ki 4699±n/a nM
Citation Wright, GEGambino, JJ Quantitative structure-activity relationships of 6-anilinouracils as inhibitors of Bacillus subtilis DNA polymerase III. J Med Chem27:181-5 (1984) DNA topoisomerase 3
Name:DNA topoisomerase 3
Type:PROTEIN
Mol. Mass.:81515.22
Organism:Bacillus subtilis
Description:ChEMBL_54525
Residue:727
BDBM50028331
NameBDBM50028331
Synonyms:6-(3-Iodo-phenylamino)-1H-pyrimidine-2,4-dione | CHEMBL300465
TypeSmall organic molecule
Emp. Form.C10H8IN3O2
Mol. Mass.329.0939
SMILESIc1cccc(Nc2cc(=O)[nH]c(=O)[nH]2)c1