Reaction Details
TargetD(2) dopamine receptor
LigandBDBM11638
Substrate/Competitorn/a
Meas. Tech.ChEBML_59717
IC50 200±n/a nM
Citation Guan, JHNeumeyer, JLFiler, CNAhern, DGLilly, LWatanabe, MGrigoriadis, DSeeman, P Aporphines. 58. N-(2-chloroethyl) [8,9-2H]norapomorphine, an irreversible ligand for dopamine receptors: synthesis and application. J Med Chem27:806-10 (1984) D(2) dopamine receptor
Name:D(2) dopamine receptor
Type:Enzyme Catalytic Domain
Mol. Mass.:50587.58
Organism:CANINE
Description:DOPAMINE D1 DRD1 CANINE::Q9GJU1
Residue:443
BDBM11638
NameBDBM11638
Synonyms:CHEMBL26 N-[(1-ethylpyrrolidin-2-yl)methyl]-2-methoxy-5-sulfamoylbenzamide SULPIRIDE,(-) Sulpiride, SLP US10172837, Sulpiride
TypeSmall organic molecule
Emp. Form.C15H23N3O4S
Mol. Mass.341.426
SMILESCCN1CCCC1CNC(=O)c1cc(ccc1OC)S(N)(=O)=O