Reaction Details
TargetNeutrophil elastase
LigandBDBM50405197
Substrate/Competitorn/a
Meas. Tech.ChEBML_63630
Ki 6309573±n/a nM
Citation Spencer, RWCopp, LJPfister, JR Inhibition of human leukocyte elastase, porcine pancreatic elastase, and chymotrypsin by elasnin and other 4-hydroxy-2-pyrones. J Med Chem28:1828-32 (1986) Neutrophil elastase
Name:Neutrophil elastase
Type:Enzyme
Mol. Mass.:28532.38
Organism:Homo sapiens (Human)
Description:P08246
Residue:267
BDBM50405197
NameBDBM50405197
Synonyms:CHEMBL51918
TypeSmall organic molecule
Emp. Form.C7H8O3
Mol. Mass.140.1366
SMILESCc1cc(O)c(C)c(=O)o1