Reaction Details
TargetChymotrypsin-like elastase family member 1
LigandBDBM50405195
Substrate/Competitorn/a
Meas. Tech.ChEBML_153468
Ki 3235937±n/a nM
Citation Spencer, RWCopp, LJPfister, JR Inhibition of human leukocyte elastase, porcine pancreatic elastase, and chymotrypsin by elasnin and other 4-hydroxy-2-pyrones. J Med Chem28:1828-32 (1986) Chymotrypsin-like elastase family member 1
Name:Chymotrypsin-like elastase family member 1
Type:Enzyme
Mol. Mass.:28827.71
Organism:Sus scrofa (Pig)
Description:P00772
Residue:266
BDBM50405195
NameBDBM50405195
Synonyms:CHEMBL52697
TypeSmall organic molecule
Emp. Form.C15H14O4
Mol. Mass.258.2693
SMILESCc1c(CC(=O)c2ccccc2)oc(=O)c(C)c1O