Reaction Details
TargetLutropin-choriogonadotropic hormone receptor
LigandBDBM50405764
Substrate/Competitorn/a
Meas. Tech.ChEMBL_100146 (CHEMBL712503)
Ki 1.2±n/a nM
Citation Haviv, FPalabrica, CABush, ENDiaz, GJohnson, ESLove, SGreer, J Active reduced-size hexapeptide analogues of luteinizing hormone-releasing hormone. J Med Chem32:2340-4 (1989) Lutropin-choriogonadotropic hormone receptor
Name:Lutropin-choriogonadotropic hormone receptor
Type:PROTEIN
Mol. Mass.:78049.26
Organism:Rattus norvegicus
Description:ChEMBL_97289
Residue:700
BDBM50405764
NameBDBM50405764
Synonyms:CHEMBL264298
TypeSmall organic molecule
Emp. Form.C61H75N11O9
Mol. Mass.1106.3165
SMILESCCNC(=O)C1CCCN1C(=O)[C@H](CCCNC(N)=N)NC(=O)[C@H](CC(C)C)NC(=O)[C@@H](Cc1c[nH]c2ccccc12)NC(=O)[C@H](Cc1ccc(O)cc1)NC(=O)[C@H](COCc1ccccc1)NC(=O)Cc1cccc2ccccc12