Reaction Details
TargetDihydrofolate reductase
LigandBDBM50406011
Substrate/Competitorn/a
Meas. Tech.ChEMBL_54558 (CHEMBL664873)
Ki 0.43±n/a nM
Citation Johnson, JVRauchman, BSBaccanari, DPRoth, B 2,4-Diamino-5-benzylpyrimidines and analogues as antibacterial agents. 12. 1,2-Dihydroquinolylmethyl analogues with high activity and specificity for bacterial dihydrofolate reductase. J Med Chem32:1942-9 (1989) Dihydrofolate reductase
Name:Dihydrofolate reductase
Type:n/a
Mol. Mass.:17532.46
Organism:Escherichia coli
Description:n/a
Residue:157
BDBM50406011
NameBDBM50406011
Synonyms:CHEMBL300545
TypeSmall organic molecule
Emp. Form.C18H23N5S
Mol. Mass.341.474
SMILESCSc1cc(Cc2cnc(N)nc2N)cc2C(C)=CC(C)(C)Nc12