Reaction Details
Target5-hydroxytryptamine receptor 3A/3B
LigandBDBM82561
Substrate/Competitorn/a
Meas. Tech.ChEMBL_3112 (CHEMBL620590)
Kd 6.2±n/a nM
Citation Hibert, MFHoffmann, RMiller, RCCarr, AA Conformation-activity relationship study of 5-HT3 receptor antagonists and a definition of a model for this receptor site. J Med Chem33:1594-600 (1990) 5-hydroxytryptamine receptor 3A/3B
Name:5-hydroxytryptamine receptor 3A/3B
Synonyms:Serotonin 3 receptor (5HT3)
Type:n/a
Mol. Mass.:n/a
Description:ASSAY_ID of ChEMBL is 357762
Components:This complex has 2 components.
Component 1
Name:5-hydroxytryptamine receptor 3A
Type:n/a
Mol. Mass.:56056.00
Organism:Mus musculus (house mouse)
Description:5HT3A
Residue:487
Component 2
Name:5-hydroxytryptamine receptor 3B
Synonyms:5HT3B_MOUSE Serotonin 3 receptor (5HT3) | Serotonin 3b (5-HT3b) receptor
Type:PROTEIN
Mol. Mass.:50317.35
Organism:Mus musculus
Description:ChEMBL_3121
Residue:437
BDBM82561
NameBDBM82561
Synonyms:CAS_40796-97-2 Tropanyl-3,5 dichlorobenzoate
TypeSmall organic molecule
Emp. Form.C15H17Cl2NO2
Mol. Mass.314.207
SMILESCN1[C@H]2CC[C@@H]1C[C@@H](C2)OC(=O)c1cc(Cl)cc(Cl)c1