Reaction Details
TargetPolyunsaturated fatty acid 5-lipoxygenase
LigandBDBM50009011
Substrate/Competitorn/a
Meas. Tech.ChEMBL_98489 (CHEMBL879813)
EC50 62600±n/a nM
Citation Bruneau, PDelvare, CEdwards, MPMcMillan, RM Indazolinones, a new series of redox-active 5-lipoxygenase inhibitors with built-in selectivity and oral activity. J Med Chem34:1028-36 (1991) Polyunsaturated fatty acid 5-lipoxygenase
Name:Polyunsaturated fatty acid 5-lipoxygenase
Type:Enzyme
Mol. Mass.:77972.74
Organism:Homo sapiens (Human)
Description:Recombinant protein was purified from E. coli lysate. After ammonium sulfate precipitation and subsequent steps, the supernatant (S100) was used for 5-LO activity assay.
Residue:674
BDBM50009011
NameBDBM50009011
Synonyms:2-(5-Methyl-pyridin-3-ylmethyl)-1,2-dihydro-indazol-3-one | CHEMBL3144722
TypeSmall organic molecule
Emp. Form.C14H13N3O
Mol. Mass.239.2725
SMILESCc1cncc(Cn2[nH]c3ccccc3c2=O)c1